Uploaded image for project: 'OpenOLAT'
  1. OpenOLAT
  2. OO-4492

compressjs job fails on lunr.min.js

    XMLWordPrintable

    Details

      Description

      Retranspiling the javascript code running

       mvn compile -Pcompressjs,tomcat
      

      fails currently on 14.2 (and on the master branch):
       

      [ERROR] .../src/main/webapp/static/js/paella/player/javascript/lunr.min.js:line 1:column 0:Compilation produced 26 syntax errors.
      [INFO] ------------------------------------------------------------------------
      [INFO] BUILD FAILURE
      [INFO] ------------------------------------------------------------------------
      [INFO] Total time:  14.323 s
      [INFO] Finished at: 2020-01-22T11:13:50Z
      [INFO] ------------------------------------------------------------------------
      [ERROR] Failed to execute goal net.alchim31.maven:yuicompressor-maven-plugin:1.3.2:compress (compressbootstrap) on project openolat-lms: Execution compressbootstrap of goal net.alchim31.maven:yuicompressor-maven-plugin:1.3.2:compress failed: Compilation produced 26 syntax errors. -> [Help 1]
      ...
      

        Attachments

          Activity

            People

            Assignee:
            srosse Stéphane Rossé
            Reporter:
            d.haag Daniel Haag
            Tester:
            Mandy Menzel
            Votes:
            0 Vote for this issue
            Watchers:
            3 Start watching this issue

              Dates

              Created:
              Updated:
              Resolved: